如何解决在构建Conductor期间发生的问题

2019年10月24日 4点热度 0条评论

我是Conductor的新手,我从github克隆了源代码,并尝试使用Windows OS根据https://netflix.github.io/conductor/intro/上的教程启动本地服务器,但是,它构建失败,错误消息如下:

> Task :conductor-server:server FAILED

FAILURE: Build failed with an exception.

* What went wrong:
Execution failed for task ':conductor-server:server'.
> A problem occurred starting process 'command 'C:\Program Files\Java\jdk1.8.0_74\bin\java.exe''

* Try:
Run with --info or --debug option to get more log output. Run with --scan to get full insights.

* Exception is:
org.gradle.api.tasks.TaskExecutionException: Execution failed for task ':conductor-server:server'.
        at org.gradle.api.internal.tasks.execution.ExecuteActionsTaskExecuter.executeActions(ExecuteActionsTaskExecuter.java:110)
        at org.gradle.api.internal.tasks.execution.ExecuteActionsTaskExecuter.execute(ExecuteActionsTaskExecuter.java:77)
        at org.gradle.api.internal.tasks.execution.OutputDirectoryCreatingTaskExecuter.execute(OutputDirectoryCreatingTaskExecuter.java:51)
        at org.gradle.api.internal.tasks.execution.SkipUpToDateTaskExecuter.execute(SkipUpToDateTaskExecuter.java:59)
        at org.gradle.api.internal.tasks.execution.ResolveTaskOutputCachingStateExecuter.execute(ResolveTaskOutputCachingStateExecuter.java:54)
        at org.gradle.api.internal.tasks.execution.ValidatingTaskExecuter.execute(ValidatingTaskExecuter.java:59)
        at org.gradle.api.internal.tasks.execution.SkipEmptySourceFilesTaskExecuter.execute(SkipEmptySourceFilesTaskExecuter.java:101)
        at org.gradle.api.internal.tasks.execution.FinalizeInputFilePropertiesTaskExecuter.execute(FinalizeInputFilePropertiesTaskExecuter.java:44)
        at org.gradle.api.internal.tasks.execution.CleanupStaleOutputsExecuter.execute(CleanupStaleOutputsExecuter.java:91)
        at org.gradle.api.internal.tasks.execution.ResolveTaskArtifactStateTaskExecuter.execute(ResolveTaskArtifactStateTaskExecuter.java:62)
        at org.gradle.api.internal.tasks.execution.SkipTaskWithNoActionsExecuter.execute(SkipTaskWithNoActionsExecuter.java:59)
        at org.gradle.api.internal.tasks.execution.SkipOnlyIfTaskExecuter.execute(SkipOnlyIfTaskExecuter.java:54)
        at org.gradle.api.internal.tasks.execution.ExecuteAtMostOnceTaskExecuter.execute(ExecuteAtMostOnceTaskExecuter.java:43)
        at org.gradle.api.internal.tasks.execution.CatchExceptionTaskExecuter.execute(CatchExceptionTaskExecuter.java:34)
        at org.gradle.api.internal.tasks.execution.EventFiringTaskExecuter$1.run(EventFiringTaskExecuter.java:51)
        at org.gradle.internal.operations.DefaultBuildOperationExecutor$RunnableBuildOperationWorker.execute(DefaultBuildOperationExecutor.java:317)
        at org.gradle.internal.operations.DefaultBuildOperationExecutor$RunnableBuildOperationWorker.execute(DefaultBuildOperationExecutor.java:309)
        at org.gradle.internal.operations.DefaultBuildOperationExecutor.execute(DefaultBuildOperationExecutor.java:185)
        at org.gradle.internal.operations.DefaultBuildOperationExecutor.run(DefaultBuildOperationExecutor.java:97)
        at org.gradle.internal.operations.DelegatingBuildOperationExecutor.run(DelegatingBuildOperationExecutor.java:31)
        at org.gradle.api.internal.tasks.execution.EventFiringTaskExecuter.execute(EventFiringTaskExecuter.java:46)
        at org.gradle.execution.taskgraph.DefaultTaskExecutionGraph$ExecuteTaskAction.execute(DefaultTaskExecutionGraph.java:262)
        at org.gradle.execution.taskgraph.DefaultTaskExecutionGraph$ExecuteTaskAction.execute(DefaultTaskExecutionGraph.java:246)
        at org.gradle.execution.taskgraph.DefaultTaskPlanExecutor$TaskExecutorWorker$1.execute(DefaultTaskPlanExecutor.java:136)
        at org.gradle.execution.taskgraph.DefaultTaskPlanExecutor$TaskExecutorWorker$1.execute(DefaultTaskPlanExecutor.java:130)
        at org.gradle.execution.taskgraph.DefaultTaskPlanExecutor$TaskExecutorWorker.execute(DefaultTaskPlanExecutor.java:201)
        at org.gradle.execution.taskgraph.DefaultTaskPlanExecutor$TaskExecutorWorker.executeWithTask(DefaultTaskPlanExecutor.java:192)
        at org.gradle.execution.taskgraph.DefaultTaskPlanExecutor$TaskExecutorWorker.run(DefaultTaskPlanExecutor.java:130)
        at org.gradle.internal.concurrent.ExecutorPolicy$CatchAndRecordFailures.onExecute(ExecutorPolicy.java:63)
        at org.gradle.internal.concurrent.ManagedExecutorImpl$1.run(ManagedExecutorImpl.java:46)
        at org.gradle.internal.concurrent.ThreadFactoryImpl$ManagedThreadRunnable.run(ThreadFactoryImpl.java:55)
Caused by: org.gradle.process.internal.ExecException: A problem occurred starting process 'command 'C:\Program Files\Java\jdk1.8.0_74\bin\java.exe''
        at org.gradle.process.internal.DefaultExecHandle.execExceptionFor(DefaultExecHandle.java:231)
        at org.gradle.process.internal.DefaultExecHandle.setEndStateInfo(DefaultExecHandle.java:209)
        at org.gradle.process.internal.DefaultExecHandle.failed(DefaultExecHandle.java:355)
        at org.gradle.process.internal.ExecHandleRunner.run(ExecHandleRunner.java:85)
        at org.gradle.internal.operations.CurrentBuildOperationPreservingRunnable.run(CurrentBuildOperationPreservingRunnable.java:42)
        ... 3 more
Caused by: net.rubygrapefruit.platform.NativeException: Could not start 'C:\Program Files\Java\jdk1.8.0_74\bin\java.exe'
        at net.rubygrapefruit.platform.internal.DefaultProcessLauncher.start(DefaultProcessLauncher.java:27)
        at net.rubygrapefruit.platform.internal.WindowsProcessLauncher.start(WindowsProcessLauncher.java:22)
        at net.rubygrapefruit.platform.internal.WrapperProcessLauncher.start(WrapperProcessLauncher.java:36)
        at org.gradle.process.internal.ExecHandleRunner.run(ExecHandleRunner.java:67)
        ... 4 more
Caused by: java.io.IOException: Cannot run program "C:\Program Files\Java\jdk1.8.0_74\bin\java.exe" (in directory "F:\gitdemo\conductor\server"): CreateProcess error=206, ▒ļ▒▒▒▒▒▒▒չ▒▒̫▒▒▒▒
        at net.rubygrapefruit.platform.internal.DefaultProcessLauncher.start(DefaultProcessLauncher.java:25)
        ... 7 more
Caused by: java.io.IOException: CreateProcess error=206, ▒ļ▒▒▒▒▒▒▒չ▒▒̫▒▒▒▒
        ... 8 more

解决方案如下:

发生这种情况的原因是,所有具有绝对路径的jar文件都添加到了classpath中,并且windows在build.gradle中的插件下方具有限制使用,并且您应该能够启动导体服务器

plugins {
  id 'com.github.ManifestClasspath' version '0.1.0-RELEASE'
}